{"text_format":"1","workbook":"xlsx","n_sheets":14,"sheets":["手動入力","八幡市合冊","条件表","最低制限価格算出結果","仮想工事","最低制限価格","登録情報","現場検索","基礎DATA","（平成２８年４月１日以降）低入札個別計算表","【旧】低入札個別計算表 ","Sheet1","手動入力 (2)","工事入札情報"],"not_rendered":{"charts":0,"images":1,"macros":1,"external_links":3,"defined_names":44,"comments":2,"pivot_tables":0},"unopened":[],"bounds":{"document_bytes":16777216,"sheet_cells":100000,"rows_first":2000,"rows_last":500,"rows_between":2000,"halvings":0,"cell_chars":16384,"cell_head_chars":4096},"cells_cut":0,"cells_raw":0,"read":"whole","date_system":"1900"}

{"sheet":"手動入力","index":0,"n_rows":95,"n_cols":18,"rows_kept":95,"cut":false,"hidden":true,"merged":[[48,1,48,2],[49,1,49,2],[51,1,51,2],[18,1,18,2],[0,5,0,13],[35,1,36,2],[47,1,47,2],[43,1,43,2],[39,1,39,2],[1,1,1,2],[4,1,4,2],[9,1,9,2],[16,1,16,2],[17,1,17,2],[40,1,40,2]]}
[null,"手動入力用",null,null,null,{"$f":"最低制限価格算出結果!G45&\"手動入力\"","v":"点在設計H284処分費入力手動入力"},null,null,null,null,null,null,null,null,null,{"$f":"最低制限価格算出結果!R3","v":"verH291001"}]
[null,"工事個所名",null,{"$f":"IF(OR(最低制限価格算出結果!L4=E2,最低制限価格算出結果!L4=\"\",E2=\"\"),\"\",\"工事個所　　を確認\")","v":""},null,null,null,null,null,null,null,null,null,null,null,null,{"$f":"IFERROR( VLOOKUP(H47,一覧工事検索,6,0),\"\")","v":""}]
[null,null,null,null,1]
[null,null,null,null,"水道"]
[null,"工区名",null,"合算対象　　　　　　　　　　工事費"]
[null,null,null,null,{"$f":"\"①\"&E5","v":"①"},{"$f":"\"②\"&F5","v":"②"},{"$f":"\"③\"&G5","v":"③"},{"$f":"\"④\"&手動入力!$H$5","v":"④"},{"$f":"\"⑤\"&手動入力!$I$5","v":"⑤"},{"$f":"\"⑥\"&手動入力!$J$5","v":"⑥"},{"$f":"\"⑦\"&K5","v":"⑦"},{"$f":"\"⑧\"&L5","v":"⑧"},{"$f":"\"⑨\"&M5","v":"⑨"},{"$f":"\"⑩\"&N5","v":"⑩"},{"$f":"\"⑪\"&O5","v":"⑪"},{"$f":"\"⑫\"&P5","v":"⑫"}]
{"$rows_left_out":90}
{"sheet":"八幡市合冊","index":1,"n_rows":93,"n_cols":16,"rows_kept":93,"cut":false,"hidden":false,"merged":[[90,8,90,9],[90,10,90,11],[90,12,90,13],[90,14,90,15],[10,10,11,10],[12,10,13,10],[15,7,15,8],[16,7,16,8],[67,6,67,9],[87,8,87,9],[87,10,87,11],[87,12,87,13],[87,14,87,15],[44,6,44,7],[89,8,89,9],[89,10,89,11],[92,8,92,9],[92,10,92,11],[92,12,92,13],[92,14,92,15],[91,8,91,9],[91,10,91,11],[91,12,91,13],[91,14,91,15],[89,12,89,13],[89,14,89,15],[88,8,88,9],[88,10,88,11],[88,12,88,13],[88,14,88,15],[86,8,86,9],[86,10,86,11],[86,12,86,13],[86,14,86,15],[85,8,85,9],[85,10,85,11],[85,12,85,13],[85,14,85,15],[84,8,84,9],[84,10,84,11],[84,12,84,13],[84,14,84,15],[83,8,83,9],[83,10,83,11],[83,12,83,13],[83,14,83,15],[80,8,80,9],[80,10,80,11],[80,12,80,13],[80,14,80,15],[82,8,82,9],[82,10,82,11],[82,12,82,13],[82,14,82,15],[81,8,81,9],[81,10,81,11],[81,12,81,13],[81,14,81,15],[2,7,2,12],[3,7,4,12],[50,6,50,7],[51,6,53,7],[64,6,64,7],[31,6,33,7],[12,6,13,6],[3,6,4,6],[4,13,4,15],[10,9,11,9],[78,6,78,15],[20,6,20,7],[48,6,48,7],[49,6,49,7],[12,7,13,8],[12,9,13,9],[14,7,14,8],[65,6,65,7],[71,14,74,14],[72,9,72,10],[73,6,73,7],[73,9,73,10],[74,9,74,10],[77,8,77,12]]}
[]
[]
[null,null,null,null,null,null,null,{"$f":"IF(G74=\"点在設計\",\"点在経費計算書\",IF(G74=\"合冊設計\",\"合冊経費計算書\",IF(G74=\"合算点在計算\",\"合算点在経費計算書\",\"経費計算書\")))","v":"経費計算書"},null,null,null,null,null,"verH291001"]
[null,null,null,null,null,null,"工事箇所名","平成２９年度男山泉地区配水管布設替工事",null,null,null,null,null,{"$f":"IF(I74=\"Ｋ\",\"京都市　最低制限価格一覧\",\"八幡市　水道＋道路\")","v":"八幡市　水道＋道路"}]
[null,null,null,null,null,null,null,null,null,null,null,null,null,"この計算結果はシミュレーションであり金額を保証するものではありません。"]
[null,null,null,null,null,null,"管理番号",{"$f":"IF(N72>0,N72,手動入力!H47)","v":0},null,{"$f":"IF(OR(手動入力!E2=H4,手動入力!E2=\"\"),\"\",IF(H4=\"\",\"\",\"工事名が相違しています\"))","v":""},null,null,null,{"$f":"IF(I74=\"Ｋ\",\"ランダム係数\",\"α値\")","v":"α値"},"＊注）参考　最低制限価格","摘要"]
{"$rows_left_out":88}
{"sheet":"条件表","index":2,"n_rows":165,"n_cols":10,"rows_kept":165,"cut":false,"hidden":true,"merged":[[122,4,122,5],[122,6,122,9]]}
[]
["1:河川・道路構造物工事"]
["2:海岸工事"]
["3:道路改良工事"]
["4:鋼橋架設工事"]
["5:PC橋工事"]
{"$rows_left_out":160}
{"sheet":"最低制限価格算出結果","index":3,"n_rows":63,"n_cols":22,"rows_kept":63,"cut":false,"hidden":true,"merged":[[57,20,57,21],[62,6,62,7],[52,6,52,7],[53,6,53,7],[54,6,54,7],[55,6,55,7],[56,6,56,7],[58,6,58,7],[59,6,59,7],[60,6,60,7],[61,6,61,7],[57,6,57,7],[60,20,60,21],[61,20,61,21],[62,20,62,21],[59,20,59,21],[61,18,61,19],[54,18,54,19],[55,18,55,19],[62,14,62,15],[58,14,58,15],[59,14,59,15],[60,14,60,15],[61,14,61,15],[48,6,48,21],[50,20,50,21],[51,20,51,21],[52,20,52,21],[53,20,53,21],[54,20,54,21],[55,20,55,21],[56,20,56,21],[58,20,58,21],[50,18,50,19],[50,10,50,11],[50,12,50,13],[50,14,50,15],[50,16,50,17],[51,10,51,11],[49,6,49,7],[50,6,50,7],[51,6,51,7],[51,12,51,13],[51,14,51,15],[51,16,51,17],[51,18,51,19],[52,18,52,19],[53,18,53,19],[2,11,2,16],[12,14,13,15],[12,11,13,12],[16,13,17,13],[16,14,17,14],[16,16,17,16],[4,17,4,19],[47,11,47,15],[45,9,45,10],[44,9,44,10],[43,9,43,10],[42,14,45,14],[16,15,17,15],[14,9,14,10],[15,9,15,10],[16,9,17,10],[14,11,14,12],[16,11,17,12],[3,11,4,16],[3,9,4,9],[12,13,13,13],[12,9,13,10],[10,14,11,15],[10,13,11,13],[19,6,19,7],[20,6,20,7],[21,6,21,7],[22,6,22,7],[23,6,23,7],[24,6,24,7],[25,6,27,7],[37,6,37,7],[38,6,38,7],[39,6,39,7],[44,6,44,7],[61,12,61,13],[62,12,62,13],[58,10,58,11],[59,10,59,11],[60,10,60,11],[61,10,61,11],[52,10,52,11],[53,10,53,11],[54,10,54,11],[55,10,55,11],[56,10,56,11],[62,10,62,11],[57,10,57,11],[57,12,57,13],[52,12,52,13],[53,12,53,13],[54,12,54,13],[55,12,55,13],[56,12,56,13],[58,12,58,13],[59,12,59,13],[60,12,60,13],[58,16,58,17],[59,16,59,17],[60,16,60,17],[62,18,62,19],[62,16,62,17],[56,16,56,17],[61,16,61,17],[52,14,52,15],[53,14,53,15],[54,14,54,15],[55,14,55,15],[55,16,55,17],[52,16,52,17],[56,14,56,15],[56,18,56,19],[58,18,58,19],[59,18,59,19],[60,18,60,19],[53,16,53,17],[54,16,54,17],[57,14,57,15],[57,16,57,17],[57,18,57,19]]}
[]
[]
[null,null,null,null,null,null,null,null,null,null,null,{"$f":"IF(G45=\"点在設計\",\"点在経費計算書\",IF(G45=\"合冊設計\",\"合冊経費計算書\",IF(G45=\"合算点在計算\",\"合算点在経費計算書\",\"経費計算書\")))","v":"経費計算書"},null,null,null,null,null,"verH291001"]
[null,null,null,null,null,null,null,null,null,"工事箇所名",null,{"$f":"IFERROR(最低制限価格!E2,\"\")","v":0},null,null,null,null,null,{"$f":"IF(I45=\"Ｋ\",\"京都市　最低制限価格一覧\",G45)","v":{"$error":"#N/A"}}]
[null,null,null,null,null,null,null,null,null,null,null,null,null,null,null,null,null,"この計算結果はシミュレーションであり金額を保証するものではありません。"]
[null,null,null,null,null,null,null,{"$f":"IF(手動入力!D40>0,\"\",IF(手動入力!D33>0,\"\",IF(N43>0,,\"一般管理費対象額を入力\")))","v":{"$error":"#REF!"}},null,"管理番号",null,{"$f":"IF(N43>0,N43,手動入力!H47)","v":0},null,{"$f":"IF(OR(手動入力!E2=L4,手動入力!E2=\"\"),\"\",IF(L4=\"\",\"\",\"工事名が相違しています\"))","v":""},null,null,null,{"$f":"IF(I45=\"Ｋ\",\"ランダム係数\",\"α値\")","v":{"$error":"#N/A"}},"＊注）参考　最低制限価格","摘要"]
{"$rows_left_out":58}
{"sheet":"仮想工事","index":4,"n_rows":42,"n_cols":20,"rows_kept":42,"cut":false,"hidden":true,"merged":[[26,9,26,14],[31,5,31,6],[32,5,32,6],[33,5,33,6],[39,3,39,4],[27,5,27,6],[29,5,29,6],[30,5,30,6]]}
[]
[null,null,"工事名",{"$f":"IFERROR(手動入力!E2,VLOOKUP(最低制限価格算出結果!$L$6,一覧工事検索,6,0))","v":0}]
[null,null,"算出価格最低制限価"]
[]
[null,null,"費目名",null,"設計価格",null,"基準価格"]
[]
{"$rows_left_out":37}
{"sheet":"最低制限価格","index":5,"n_rows":46,"n_cols":31,"rows_kept":46,"cut":false,"hidden":true,"merged":[[4,3,6,4],[4,5,4,6],[4,8,6,8],[5,5,5,6],[2,6,2,7],[20,24,20,26],[24,5,24,6],[31,5,31,6],[30,5,30,6],[28,5,28,6],[27,5,27,6],[26,5,26,6],[23,5,23,6],[34,24,34,26],[24,3,24,4],[29,3,31,3],[23,3,23,4],[29,5,29,6],[25,3,28,3],[25,5,25,6]]}
[]
[null,null,null,"工事名",{"$f":"IFERROR(VLOOKUP(E3,一覧工事検索,6,0),手動入力!E2)","v":0}]
[null,null,null,"番号",{"$f":"IF(現場検索!C2>0,現場検索!C2,手動入力!E2)","v":{"$error":"#NAME?"}},null,"算出価格最低制限価",null,null,"変換率・丸め設定京都府 - 平成25年5月"]
[]
[null,null,null,"費目名",null,"設計価格",null,null,"変換率","設計書に反映する価格"]
[null,null,null,null,null,null,null,null,null,{"$f":"IF(仮想工事!I9=0,\"\",IF(手動入力!E5=\"\",\"1工区\",手動入力!E5))","v":"1工区"},{"$f":"IF(仮想工事!J9=0,\"\",IF(手動入力!F5=\"\",\"2工区\",手動入力!F5))","v":"2工区"},{"$f":"IF(仮想工事!K9=0,\"\",IF(手動入力!G5=\"\",\"3工区\",手動入力!G5))","v":"3工区"},{"$f":"IF(仮想工事!L9=0,\"\",IF(手動入力!H5=\"\",\"4工区\",手動入力!H5))","v":"4工区"},{"$f":"IF(仮想工事!M9=0,\"\",IF(手動入力!I5=\"\",\"5工区\",手動入力!I5))","v":"5工区"},{"$f":"IF(仮想工事!N9=0,\"\",IF(手動入力!J5=\"\",\"6工区\",手動入力!J5))","v":"6工区"},{"$f":"IF(仮想工事!O9=0,\"\",IF(手動入力!K5=\"\",\"7工区\",手動入力!K5))","v":"7工区"},{"$f":"IF(仮想工事!P9=0,\"\",IF(手動入力!L5=\"\",\"8工区\",手動入力!L5))","v":"8工区"},{"$f":"IF(仮想工事!Q9=0,\"\",IF(手動入力!M5=\"\",\"9工区\",手動入力!M5))","v":"9工区"},{"$f":"IF(仮想工事!R9=0,\"\",IF(手動入力!N5=\"\",\"\",手動入力!N5))","v":""},{"$f":"IF(仮想工事!S9=0,\"\",IF(手動入力!O5=\"\",\" \",手動入力!O5))","v":" "},{"$f":"IF(仮想工事!T9=0,\"\",IF(手動入力!P5=\"\",\"\",手動入力!P5))","v":""}]
{"$rows_left_out":41}
{"sheet":"登録情報","index":6,"n_rows":26,"n_cols":3,"rows_kept":26,"cut":false,"hidden":true,"merged":[]}
[null,"登録情報","最低制限価格算出結果"]
[]
["土木事務所"]
["総合評価"]
["開札年月日"]
["種別"]
{"$rows_left_out":21}
{"sheet":"現場検索","index":7,"n_rows":37,"n_cols":13,"rows_kept":37,"cut":false,"hidden":true,"merged":[]}
["経費管理\\[京都府価格算出参考資料ver2016-01.xlsm]一覧'!$A:$Bc",null,null,null,"工事実績一覧表"]
[null,null,{"$f":"IF(AND(手動入力!H47=\"\",最低制限価格算出結果!N43=\"\"),test,IF(手動入力!H47=\"\",最低制限価格算出結果!N43,手動入力!H47))","v":{"$error":"#NAME?"}},null,{"$f":"最低制限価格算出結果!J50","v":"H2805-142"},null,null,{"$f":"最低制限価格算出結果!L50","v":"281212-001"},{"$f":"最低制限価格算出結果!N50","v":"H2805-138"},{"$f":"最低制限価格算出結果!P50","v":"2803-248"},{"$f":"最低制限価格算出結果!R50","v":"2803-249"},{"$f":"最低制限価格算出結果!T50","v":"271111-59"},{"$f":"最低制限価格算出結果!V50","v":"271109-261"}]
[]
[null,"工事名",{"$f":"VLOOKUP(C2,一覧工事検索,6,0)","v":{"$error":"#NAME?"}},null,{"$f":"VLOOKUP(E2,一覧工事検索,6,0)","v":{"$error":"#N/A"}},null,null,{"$f":"VLOOKUP(H2,一覧工事検索,6,0)","v":"管内一円（長尾八幡線）地域振興道路工事"},{"$error":"#N/A"},{"$error":"#N/A"},{"$error":"#N/A"},{"$error":"#N/A"},{"$error":"#N/A"}]
[null,"個所名",{"$f":"VLOOKUP(C2,一覧工事検索,8,0)&VLOOKUP(C2,一覧工事検索,9,0)","v":{"$error":"#NAME?"}},null,{"$f":"VLOOKUP(E2,一覧工事検索,8,0)&VLOOKUP(E2,一覧工事検索,9,0)","v":{"$error":"#N/A"}},null,null,{"$f":"VLOOKUP(H2,一覧工事検索,8,0)&VLOOKUP(H2,一覧工事検索,9,0)","v":"舗装工事影響受ける"},{"$error":"#N/A"},{"$error":"#N/A"},{"$error":"#N/A"},{"$error":"#N/A"},{"$error":"#N/A"}]
[null,"直接工事費計",{"$f":"VLOOKUP(C$2,一覧工事検索,22,0)","v":{"$error":"#NAME?"}},null,{"$f":"VLOOKUP(E$2,一覧工事検索,22,0)","v":{"$error":"#N/A"}},null,null,{"$f":"VLOOKUP(H$2,一覧工事検索,22,0)","v":0.87424425634824665},{"$error":"#N/A"},{"$error":"#N/A"},{"$error":"#N/A"},{"$error":"#N/A"},{"$error":"#N/A"}]
{"$rows_left_out":32}
{"sheet":"基礎DATA","index":8,"n_rows":27,"n_cols":1,"rows_kept":27,"cut":false,"hidden":true,"merged":[]}
[]
[]
[]
[]
[]
[]
{"$rows_left_out":22}
{"sheet":"（平成２８年４月１日以降）低入札個別計算表","index":9,"n_rows":109,"n_cols":52,"rows_kept":109,"cut":false,"hidden":true,"merged":[[106,1,107,10],[106,11,107,20],[106,21,107,30],[106,31,107,40],[106,41,109,60],[108,1,109,10],[108,11,109,20],[108,21,109,30],[108,31,109,40],[102,1,103,10],[102,11,103,20],[102,21,103,30],[102,31,103,40],[102,41,103,50],[102,51,103,60],[104,1,105,10],[104,11,105,20],[104,21,105,30],[104,31,105,40],[104,41,105,50],[104,51,105,60],[98,1,99,10],[98,11,99,20],[98,21,99,30],[98,31,99,40],[98,41,99,50],[98,51,99,60],[100,1,101,10],[100,11,101,20],[100,21,101,30],[100,31,101,40],[100,41,101,50],[100,51,101,60],[94,1,95,10],[94,11,95,20],[94,21,95,30],[94,31,95,40],[94,41,95,50],[94,51,95,60],[96,1,97,10],[96,11,97,20],[96,21,97,30],[96,31,97,40],[96,41,97,50],[96,51,97,60],[90,1,91,10],[90,11,91,20],[90,21,91,30],[90,31,91,40],[90,41,91,50],[90,51,91,60],[92,1,93,10],[92,11,93,20],[92,21,93,30],[92,31,93,40],[92,41,93,50],[92,51,93,60],[86,1,87,10],[86,11,87,20],[86,21,87,30],[86,31,87,40],[86,41,87,50],[86,51,87,60],[88,1,89,10],[88,11,89,20],[88,21,89,30],[88,31,89,40],[88,41,89,50],[88,51,89,60],[82,1,83,10],[82,11,83,20],[82,21,83,30],[82,31,83,40],[82,41,83,50],[82,51,83,60],[84,1,85,10],[84,11,85,20],[84,21,85,30],[84,31,85,40],[84,41,85,50],[84,51,85,60],[78,1,79,10],[78,11,79,20],[78,21,79,30],[78,31,79,40],[78,41,79,50],[78,51,79,60],[80,1,81,10],[80,11,81,20],[80,21,81,30],[80,31,81,40],[80,41,81,50],[80,51,81,60],[74,1,75,10],[74,11,75,20],[74,21,75,30],[74,31,75,40],[74,41,75,50],[74,51,75,60],[76,1,77,10],[76,11,77,20],[76,21,77,30],[76,31,77,40],[76,41,77,50],[76,51,77,60],[70,1,71,10],[70,11,71,20],[70,21,71,30],[70,31,71,40],[70,41,71,50],[70,51,71,60],[72,1,73,10],[72,11,73,20],[72,21,73,30],[72,31,73,40],[72,41,73,50],[72,51,73,60],[66,1,67,10],[66,11,67,20],[66,21,67,30],[66,31,67,40],[66,41,67,50],[66,51,67,60],[68,1,69,10],[68,11,69,20],[68,21,69,30],[68,31,69,40],[68,41,69,50],[68,51,69,60],[62,1,63,10],[62,11,63,20],[62,21,63,30],[62,31,63,40],[62,41,63,50],[62,51,63,60],[64,1,65,10],[64,11,65,20],[64,21,65,30],[64,31,65,40],[64,41,65,50],[64,51,65,60],[58,1,59,10],[58,11,59,20],[58,21,59,30],[58,31,59,40],[58,41,59,50],[58,51,59,60],[60,1,61,10],[60,11,61,20],[60,21,61,30],[60,31,61,40],[60,41,61,50],[60,51,61,60],[54,1,55,10],[54,11,55,20],[54,21,55,30],[54,31,55,40],[54,41,55,50],[54,51,55,60],[56,1,57,10],[56,11,57,20],[56,21,57,30],[56,31,57,40],[56,41,57,50],[56,51,57,60],[50,1,51,10],[50,11,51,20],[50,21,51,30],[50,31,51,40],[50,41,51,50],[50,51,51,60],[52,1,53,10],[52,11,53,20],[52,21,53,30],[52,31,53,40],[52,41,53,50],[52,51,53,60],[46,1,47,10],[46,11,47,20],[46,21,47,30],[46,31,47,40],[46,41,47,50],[46,51,47,60],[48,1,49,10],[48,11,49,20],[48,21,49,30],[48,31,49,40],[48,41,49,50],[48,51,49,60],[42,1,43,10],[42,11,43,20],[42,21,43,30],[42,31,43,40],[42,41,43,50],[42,51,43,60],[44,1,45,10],[44,11,45,20],[44,21,45,30],[44,31,45,40],[44,41,45,50],[44,51,45,60],[38,1,39,10],[38,11,39,20],[38,21,39,30],[38,31,39,40],[38,41,39,50],[38,51,39,60],[40,1,41,10],[40,11,41,20],[40,21,41,30],[40,31,41,40],[40,41,41,50],[40,51,41,60],[34,1,35,10],[34,11,35,20],[34,21,35,30],[34,31,35,40],[34,41,35,50],[34,51,35,60],[36,1,37,10],[36,11,37,20],[36,21,37,30],[36,31,37,40],[36,41,37,50],[36,51,37,60],[30,1,31,10],[30,11,31,20],[30,21,31,30],[30,31,31,40],[30,41,31,50],[30,51,31,60],[32,1,33,10],[32,11,33,20],[32,21,33,30],[32,31,33,40],[32,41,33,50],[32,51,33,60],[17,49,18,60],[19,1,20,15],[19,16,20,32],[19,37,20,60],[21,1,22,15],[21,16,22,32],[21,37,22,60],[24,1,25,60],[26,1,27,10],[26,11,27,20],[26,21,27,30],[26,31,27,40],[26,41,27,50],[26,51,27,60],[1,1,2,60],[4,46,5,50],[4,51,5,60],[7,1,8,6],[7,7,8,60],[10,1,11,60],[28,1,29,10],[28,11,29,20],[28,21,29,30],[28,31,29,40],[28,41,29,50],[28,51,29,60],[13,1,14,15],[13,16,14,32],[13,33,22,36],[13,37,14,48],[13,49,14,60],[15,1,16,15],[15,16,16,32],[15,37,16,48],[15,49,16,60],[17,1,18,15],[17,16,18,32],[17,37,18,48]]}
[]
[null,"京都府　最低制限価格一覧（α値）"]
[]
[]
[null,null,null,null,null,null,null,null,null,null,null,null,null,null,null,null,null,null,null,null,null,null,null,null,null,null,null,null,null,null,null,null,null,null,null,null,null,null,null,null,null,null,null,null,null,null,"予定価格"]
[]
{"$rows_left_out":104}
{"sheet":"【旧】低入札個別計算表 ","index":10,"n_rows":109,"n_cols":52,"rows_kept":109,"cut":false,"hidden":true,"merged":[[106,1,107,10],[106,11,107,20],[106,21,107,30],[106,31,107,40],[106,41,109,60],[108,1,109,10],[108,11,109,20],[108,21,109,30],[108,31,109,40],[104,1,105,10],[104,11,105,20],[104,21,105,30],[104,31,105,40],[104,41,105,50],[104,51,105,60],[102,1,103,10],[102,11,103,20],[102,21,103,30],[102,31,103,40],[102,41,103,50],[102,51,103,60],[100,1,101,10],[100,11,101,20],[100,21,101,30],[100,31,101,40],[100,41,101,50],[100,51,101,60],[98,1,99,10],[98,11,99,20],[98,21,99,30],[98,31,99,40],[98,41,99,50],[98,51,99,60],[96,1,97,10],[96,11,97,20],[96,21,97,30],[96,31,97,40],[96,41,97,50],[96,51,97,60],[94,1,95,10],[94,11,95,20],[94,21,95,30],[94,31,95,40],[94,41,95,50],[94,51,95,60],[92,1,93,10],[92,11,93,20],[92,21,93,30],[92,31,93,40],[92,41,93,50],[92,51,93,60],[90,1,91,10],[90,11,91,20],[90,21,91,30],[90,31,91,40],[90,41,91,50],[90,51,91,60],[88,1,89,10],[88,11,89,20],[88,21,89,30],[88,31,89,40],[88,41,89,50],[88,51,89,60],[86,1,87,10],[86,11,87,20],[86,21,87,30],[86,31,87,40],[86,41,87,50],[86,51,87,60],[84,1,85,10],[84,11,85,20],[84,21,85,30],[84,31,85,40],[84,41,85,50],[84,51,85,60],[82,1,83,10],[82,11,83,20],[82,21,83,30],[82,31,83,40],[82,41,83,50],[82,51,83,60],[80,1,81,10],[80,11,81,20],[80,21,81,30],[80,31,81,40],[80,41,81,50],[80,51,81,60],[78,1,79,10],[78,11,79,20],[78,21,79,30],[78,31,79,40],[78,41,79,50],[78,51,79,60],[76,1,77,10],[76,11,77,20],[76,21,77,30],[76,31,77,40],[76,41,77,50],[76,51,77,60],[74,1,75,10],[74,11,75,20],[74,21,75,30],[74,31,75,40],[74,41,75,50],[74,51,75,60],[72,1,73,10],[72,11,73,20],[72,21,73,30],[72,31,73,40],[72,41,73,50],[72,51,73,60],[70,1,71,10],[70,11,71,20],[70,21,71,30],[70,31,71,40],[70,41,71,50],[70,51,71,60],[68,1,69,10],[68,11,69,20],[68,21,69,30],[68,31,69,40],[68,41,69,50],[68,51,69,60],[66,1,67,10],[66,11,67,20],[66,21,67,30],[66,31,67,40],[66,41,67,50],[66,51,67,60],[64,1,65,10],[64,11,65,20],[64,21,65,30],[64,31,65,40],[64,41,65,50],[64,51,65,60],[62,1,63,10],[62,11,63,20],[62,21,63,30],[62,31,63,40],[62,41,63,50],[62,51,63,60],[60,1,61,10],[60,11,61,20],[60,21,61,30],[60,31,61,40],[60,41,61,50],[60,51,61,60],[58,1,59,10],[58,11,59,20],[58,21,59,30],[58,31,59,40],[58,41,59,50],[58,51,59,60],[56,1,57,10],[56,11,57,20],[56,21,57,30],[56,31,57,40],[56,41,57,50],[56,51,57,60],[54,1,55,10],[54,11,55,20],[54,21,55,30],[54,31,55,40],[54,41,55,50],[54,51,55,60],[52,1,53,10],[52,11,53,20],[52,21,53,30],[52,31,53,40],[52,41,53,50],[52,51,53,60],[50,1,51,10],[50,11,51,20],[50,21,51,30],[50,31,51,40],[50,41,51,50],[50,51,51,60],[48,1,49,10],[48,11,49,20],[48,21,49,30],[48,31,49,40],[48,41,49,50],[48,51,49,60],[46,1,47,10],[46,11,47,20],[46,21,47,30],[46,31,47,40],[46,41,47,50],[46,51,47,60],[44,1,45,10],[44,11,45,20],[44,21,45,30],[44,31,45,40],[44,41,45,50],[44,51,45,60],[42,1,43,10],[42,11,43,20],[42,21,43,30],[42,31,43,40],[42,41,43,50],[42,51,43,60],[40,1,41,10],[40,11,41,20],[40,21,41,30],[40,31,41,40],[40,41,41,50],[40,51,41,60],[38,1,39,10],[38,11,39,20],[38,21,39,30],[38,31,39,40],[38,41,39,50],[38,51,39,60],[36,1,37,10],[36,11,37,20],[36,21,37,30],[36,31,37,40],[36,41,37,50],[36,51,37,60],[34,1,35,10],[34,11,35,20],[34,21,35,30],[34,31,35,40],[34,41,35,50],[34,51,35,60],[32,1,33,10],[32,11,33,20],[32,21,33,30],[32,31,33,40],[32,41,33,50],[32,51,33,60],[30,1,31,10],[30,11,31,20],[30,21,31,30],[30,31,31,40],[30,41,31,50],[30,51,31,60],[28,1,29,10],[28,11,29,20],[28,21,29,30],[28,31,29,40],[28,41,29,50],[28,51,29,60],[21,1,22,15],[21,16,22,32],[21,37,22,60],[24,1,25,60],[26,1,27,10],[26,11,27,20],[26,21,27,30],[26,31,27,40],[26,41,27,50],[26,51,27,60],[19,1,20,15],[19,16,20,32],[19,37,20,60],[13,1,14,15],[13,16,14,32],[13,33,22,36],[13,37,14,48],[13,49,14,60],[15,1,16,15],[15,16,16,32],[15,37,16,48],[15,49,16,60],[17,1,18,15],[1,1,2,60],[4,46,5,50],[4,51,5,60],[7,1,8,6],[7,7,8,60],[10,1,11,60],[17,16,18,32],[17,37,18,48],[17,49,18,60]]}
[]
[null,"京都府　最低制限価格一覧（α値）"]
[]
[]
[null,null,null,null,null,null,null,null,null,null,null,null,null,null,null,null,null,null,null,null,null,null,null,null,null,null,null,null,null,null,null,null,null,null,null,null,null,null,null,null,null,null,null,null,null,null,"予定価格",null,null,null,null,15000000]
[]
{"$rows_left_out":104}
{"sheet":"Sheet1","index":11,"n_rows":39,"n_cols":13,"rows_kept":39,"cut":false,"hidden":true,"merged":[]}
[]
[null,"管内一円（鴨川他）府民公募型整備工事"]
[null,"本工事費１（九条跨線橋上流）","本工事費２（四条大橋上流）","本工事費３（出町橋上流）","施設整備"]
[null,"合冊","合冊","合冊","標準","　　　","　　　","　　　","　　　","　　　","　　　","　　　","　　　"]
[null,1,1,1,2,"","","","","","","",""]
[null,6538807,2479867,1118904,2838200]
{"$rows_left_out":34}
{"sheet":"手動入力 (2)","index":12,"n_rows":97,"n_cols":22,"rows_kept":97,"cut":false,"hidden":true,"merged":[[49,5,49,6],[50,5,50,6],[51,5,51,6],[53,5,53,6],[19,5,19,6],[20,5,20,6],[37,5,38,6],[41,5,41,6],[42,5,42,6],[45,5,45,6],[18,5,18,6],[3,9,3,17],[4,5,4,6],[4,8,4,19],[6,5,6,6],[11,5,11,6]]}
[null,null,null,null,null,null,null,null,null,{"$f":"IF(J10=1,\"\",\"②\"&J7&IF(K10=3,\"\",\"③\"&K7&IF(L10=3,\"\",\"④\"&L7&IF(M10=3,\"\",\"⑤\"&M7&IF(N10=3,\"\",\"⑥\"&N7&IF(O10=3,\"\",\"⑦\"&O7&IF(P10=3,\"\",\"⑧\"&P7&IF(Q10=3,\"\",\"⑨\"&Q7&IF(R10=3,\"\",\"⑩\"&R7&IF(S10=3,\"\",\"⑪\"&S7&IF(T10=3,\"\",\"⑫\"&T7)))))))))))","v":"②本工事費２（四条大橋上流）"}]
[null,null,null,null,null,null,null,null,null,{"$f":"IF($H72=2,$J8,IF($H73=2,$K8,IF($H74=2,$L8,IF($H75=2,$M8,IF($H76=2,$N8,IF($H77=2,$O8,IF($H78=2,$P8,\"\")))))))","v":"T②本工事費２（四条大橋上流）"}]
[]
[null,null,null,null,null,"手動入力用",null,null,null,{"$f":"最低制限価格算出結果!G45&\"手動入力\"","v":"点在設計H284処分費入力手動入力"},null,null,null,null,null,null,null,null,null,{"$f":"最低制限価格算出結果!R3","v":"verH291001"}]
[null,null,null,null,null,"工事個所名",null,{"$f":"IF(OR(最低制限価格算出結果!L4=I5,最低制限価格算出結果!L4=\"\",I5=\"\"),\"\",\"工事個所　　を確認\")","v":"工事個所　　を確認"},"管内一円（鴨川他）府民公募型整備工事",null,null,null,null,null,null,null,null,null,null,null,{"$f":"IFERROR( VLOOKUP(L49,一覧工事検索,6,0),\"\")","v":""}]
[null,null,null,null,null,null,null,null,1,2,3,4,5,6,7,8,9,10,11,12]
{"$rows_left_out":92}
{"sheet":"工事入札情報","index":13,"n_rows":50,"n_cols":25,"rows_kept":50,"cut":false,"hidden":true,"merged":[]}
[null,"土木事務所","総合評価","開札年月日","種別","工事名","工事場所","工種","施工地域・工事場所による補正","①予定金額","②設計金額","②-①","③設計最低制限価格\n直95+共90+現90+一般55","④最低制限価格","④-③","現場管理費*α","α","直接工事費","共通仮設費","現場管理費","一般管理費","最低制限価格/設計価格","最低制限価格/予定価格","施工箇所点在","備考"]
[null,null,null,null,null,null,null,null,null,{"$f":"VLOOKUP(J1,一覧工事検索,2,0)","v":{"$error":"#N/A"}}]
["281212-001","山城北",null,"2016-04-15","舗装　指名","管内一円（長尾八幡線）地域振興道路工事","八幡市八幡一の坪地内","舗装工事","影響受ける",7440000,{"$f":"SUM(R3:U3)","v":7443000},{"$f":"K3-J3","v":3000},{"$f":"R3*0.95+S3*0.9+T3*0.9+U3*0.55","v":6438691.1499999994},6507000,{"$f":"N3-M3","v":68308.850000000559},{"$f":"O3/T3+0.9","v":0.93824683650615937},{"$f":"P3/0.9","v":1.0424964850068437},3442191,980185,1786000,1234624,{"$f":"N3/K3","v":0.87424425634824665},{"$f":"N3/J3","v":0.87459677419354842}]
["281212-002","道路公社　建設事務所",null,"2016-04-25","土木　Ⅰ","鳥取豊岡宮津自動車道（野田川大宮道路）道路新設工事（補助）簡易中央分離帯他（その３）工事","京丹後市大宮町三重～森本地内","道路改良工事","影響受けない",73330000,73336000,6000,64833493.699999996,64799000,-34493.69999999553,0.89760875563258269,0.99734306181398069,44353370,4881702,14425000,9675928,0.88359059670557438,0.88366289376789853]
["281212-003","丹後",null,"2016-04-28","土木　指名","箱石湊宮葛野海岸　なぎさ緊急保全工事","京丹後市久美浜町葛野他地内","海岸工事","影響受けない",3290000,3299000,9000,2868042,2878000,9958,0.9171394148020654,1.0190437942245172,1870980,291000,581000,556020,0.87238557138526829,0.87477203647416413]
["281212-004","丹後",null,"2016-04-28","土木　指名","浅茂川海岸　なぎさ緊急保全工事","京丹後市網野町浅茂川地内","海岸工事","影響受けない",2220000,2225000,5000,1935959.2,1943000,7040.8000000000466,0.91796122448979611,1.0199569160997735,1290523,168000,392000,374477,0.87325842696629219,0.87522522522522528]
{"$rows_left_out":44}